Target
Nucleosome-remodeling factor subunit BPTF
Ligand
BDBM50098305
Substrate
Meas. Tech.
ChEMBL_1502828 (CHEMBL3591388)
Kd
<100000±n/a nM
Citation
 Bamborough, PChung, CWFurze, RCGrandi, PMichon, AMSheppard, RJBarnett, HDiallo, HDixon, DPDouault, CJones, EJKaramshi, BMitchell, DJPrinjha, RKRau, CWatson, RJWerner, TDemont, EH Structure-Based Optimization of Naphthyridones into Potent ATAD2 Bromodomain Inhibitors. J Med Chem 58:6151-78 (2015)  
Target
Name:
Nucleosome-remodeling factor subunit BPTF
Synonyms:
BPTF Bromodomain and PHD finger-containing transcription factor FALZ Fetal Alzheimer antigen
Type:
PROTEIN
Mol. Mass.:
338257.07
Organism:
Homo sapiens (Human)
Description:
ChEMBL_107969
Residue:
3046
  
Inhibitor
Name:
BDBM50098305
Synonyms:
CHEMBL3590405
Type:
Small organic molecule
Emp. Form.:
C27H34N4O4S
Mol. Mass.:
510.648
SMILES:
Cc1cncc(c1)-c1ccc(N[C@@H]2CCNC[C@H]2OCC2CCS(=O)(=O)CC2)c2[nH]c(=O)c(C)cc12
: