Target
Bromodomain-containing protein 3
Ligand
BDBM50098311
Substrate
Meas. Tech.
ChEMBL_1502843 (CHEMBL3591403)
IC50
<50119±n/a nM
Citation
 Bamborough, PChung, CWFurze, RCGrandi, PMichon, AMSheppard, RJBarnett, HDiallo, HDixon, DPDouault, CJones, EJKaramshi, BMitchell, DJPrinjha, RKRau, CWatson, RJWerner, TDemont, EH Structure-Based Optimization of Naphthyridones into Potent ATAD2 Bromodomain Inhibitors. J Med Chem 58:6151-78 (2015)  
Target
Name:
Bromodomain-containing protein 3
Synonyms:
BRD3 Bromodomain and extra-terminal motif (BET) Bromodomain-containing protein 3 (BRD3) RING3-like protein | RING3L
Type:
Protein
Mol. Mass.:
79571.81
Organism:
Homo sapiens (Human)
Description:
Q15059
Residue:
726
  
Inhibitor
Name:
BDBM50098311
Synonyms:
CHEMBL3590408
Type:
Small organic molecule
Emp. Form.:
C27H35N5O4S
Mol. Mass.:
525.663
SMILES:
CN1CC[C@@H](Nc2ncc(-c3cncc(C)c3)c3cc(C)c(=O)[nH]c23)[C@@H](C1)OCC1CCS(=O)(=O)CC1
: