Target
Histone deacetylase 3
Ligand
BDBM50098420
Substrate
Meas. Tech.
ChEMBL_1505086 (CHEMBL3596005)
IC50
2.3±n/a nM
Citation
 Clausen, DJSmith, WBHaines, BEWiest, OBradner, JEWilliams, RM Modular synthesis and biological activity of pyridyl-based analogs of the potent Class I Histone Deacetylase Inhibitor Largazole. Bioorg Med Chem 23:5061-74 (2015)  
Target
Name:
Histone deacetylase 3
Synonyms:
HD3 HDAC3_HUMAN Human HDAC3 SMAP45
Type:
Enzyme
Mol. Mass.:
48829.55
Organism:
Homo sapiens (Human)
Description:
O15379
Residue:
428
  
Inhibitor
Name:
BDBM50098420
Synonyms:
CHEMBL3593411
Type:
Small organic molecule
Emp. Form.:
C23H30N4O4S2
Mol. Mass.:
490.639
SMILES:
CC(C)[C@@H]1NC(=O)[C@]2(C)CSC(=N2)c2ccnc(CNC(=O)C[C@H](OC1=O)\C=C\CCS)c2
: