Target
Tyrosine-protein kinase JAK1
Ligand
BDBM50098427
Substrate
Meas. Tech.
ChEMBL_1505112 (CHEMBL3594577)
IC50
1.5±n/a nM
Citation
 Yamagishi, HShirakami, SNakajima, YTanaka, ATakahashi, FHamaguchi, HHatanaka, KMoritomo, AInami, MHigashi, YInoue, T Discovery of 3,6-dihydroimidazo[4,5-d]pyrrolo[2,3-b]pyridin-2(1H)-one derivatives as novel JAK inhibitors. Bioorg Med Chem 23:4846-59 (2015)  
Target
Name:
Tyrosine-protein kinase JAK1
Synonyms:
JAK-1 JAK1A JAK1_HUMAN Janus kinase 1 (JAK1) | Janus kinase 1 JAK1
Type:
Protein
Mol. Mass.:
133293.73
Organism:
Homo sapiens (Human)
Description:
P23458
Residue:
1154
  
Inhibitor
Name:
BDBM50098427
Synonyms:
CHEMBL3593591
Type:
Small organic molecule
Emp. Form.:
C17H18N6O2
Mol. Mass.:
338.3638
SMILES:
C[C@@H]1CCN(C[C@@H]1n1c2c(cnc3[nH]ccc23)[nH]c1=O)C(=O)CC#N
: