Target
Sodium-dependent serotonin transporter
Ligand
BDBM50098893
Substrate
Meas. Tech.
ChEMBL_1456968 (CHEMBL3368419)
IC50
379±n/a nM
Citation
 Zheng, YYWeng, ZJXie, PZhu, MYXing, LXLi, JQ Synthesis and pharmacological investigation of aralkyl diamine derivatives as potential triple reuptake inhibitors. Eur J Med Chem 86:219-34 (2014)  
Target
Name:
Sodium-dependent serotonin transporter
Synonyms:
5-HT Transporter 5HTT SC6A4_HUMAN SLC6A4 Serotonin transporter (5HTT) Sodium-dependent serotonin transporter (SERT) | Solute carrier family 6 member 4
Type:
Multi-pass membrane protein
Mol. Mass.:
70322.51
Organism:
Homo sapiens (Human)
Description:
P31645
Residue:
630
  
Inhibitor
Name:
BDBM50098893
Synonyms:
CHEMBL3334797
Type:
Small organic molecule
Emp. Form.:
C15H22Cl2N2O
Mol. Mass.:
317.254
SMILES:
CN(C)CCC(N1CCOCC1)c1ccc(Cl)c(Cl)c1
: