Target
Sodium-dependent dopamine transporter
Ligand
BDBM50098810
Substrate
Meas. Tech.
ChEMBL_1456970 (CHEMBL3368421)
IC50
863±n/a nM
Citation
 Zheng, YYWeng, ZJXie, PZhu, MYXing, LXLi, JQ Synthesis and pharmacological investigation of aralkyl diamine derivatives as potential triple reuptake inhibitors. Eur J Med Chem 86:219-34 (2014)  
Target
Name:
Sodium-dependent dopamine transporter
Synonyms:
DA transporter DAT1 Dopamine transporter protein (DAT) SC6A3_HUMAN Sodium-dependent dopamine transporter Solute carrier family 6 member 3
Type:
Multi-pass membrane protein
Mol. Mass.:
68497.11
Organism:
Homo sapiens (Human)
Description:
Q01959
Residue:
620
  
Inhibitor
Name:
BDBM50098810
Synonyms:
CHEMBL3334794
Type:
Small organic molecule
Emp. Form.:
C17H24N2S
Mol. Mass.:
288.451
SMILES:
CN(C)CCC(N1CCCC1)c1cc2ccccc2s1
: