Target
Sodium-dependent dopamine transporter
Ligand
BDBM50098894
Substrate
Meas. Tech.
ChEMBL_1456970 (CHEMBL3368421)
IC50
602±n/a nM
Citation
 Zheng, YYWeng, ZJXie, PZhu, MYXing, LXLi, JQ Synthesis and pharmacological investigation of aralkyl diamine derivatives as potential triple reuptake inhibitors. Eur J Med Chem 86:219-34 (2014)  
Target
Name:
Sodium-dependent dopamine transporter
Synonyms:
DA transporter DAT1 Dopamine transporter protein (DAT) SC6A3_HUMAN Sodium-dependent dopamine transporter Solute carrier family 6 member 3
Type:
Multi-pass membrane protein
Mol. Mass.:
68497.11
Organism:
Homo sapiens (Human)
Description:
Q01959
Residue:
620
  
Inhibitor
Name:
BDBM50098894
Synonyms:
CHEMBL3334798
Type:
Small organic molecule
Emp. Form.:
C16H24Cl2N2
Mol. Mass.:
315.281
SMILES:
CN(C)CCC(N1CCCCC1)c1ccc(Cl)c(Cl)c1
: