Target
Dipeptidyl peptidase 8
Ligand
BDBM50098906
Substrate
Meas. Tech.
ChEMBL_1459668 (CHEMBL3370157)
IC50
640±n/a nM
Citation
 Ji, XXia, CWang, JSu, MZhang, LDong, TLi, ZWan, XLi, JLi, JZhao, LGao, ZJiang, HLiu, H Design, synthesis and biological evaluation of 4-fluoropyrrolidine-2-carbonitrile and octahydrocyclopenta[b]pyrrole-2-carbonitrile derivatives as dipeptidyl peptidase IV inhibitors. Eur J Med Chem 86:242-56 (2014)  
Target
Name:
Dipeptidyl peptidase 8
Synonyms:
DPP8 DPRP-1 Dipeptidyl peptidase 8 (DPP-8) Dipeptidyl peptidase 8/9 Dipeptidyl peptidase VIII Prolyl dipeptidase DPP8
Type:
Enzyme
Mol. Mass.:
103342.62
Organism:
Homo sapiens (Human)
Description:
Q6V1X1
Residue:
898
  
Inhibitor
Name:
BDBM50098906
Synonyms:
CHEMBL3330054
Type:
Small organic molecule
Emp. Form.:
C15H17FIN3O
Mol. Mass.:
401.2179
SMILES:
N[C@@H](CC(=O)N1C[C@@H](F)C[C@H]1C#N)Cc1ccc(I)cc1
: