Target
Platelet-derived growth factor receptor beta
Ligand
BDBM50192844
Substrate
Meas. Tech.
ChEBML_1447789
IC50
31000±n/a nM
Citation
 Horbert, RPinchuk, BJohannes, ESchlosser, JSchmidt, DCappel, DTotzke, FSchächtele, CPeifer, C Optimization of potent DFG-in inhibitors of platelet derived growth factor receptorß (PDGF-Rß) guided by water thermodynamics. J Med Chem 58:170-82 (2015)  
Target
Name:
Platelet-derived growth factor receptor beta
Synonyms:
Beta-type platelet-derived growth factor receptor CD140b antigen PDGF Receptor Substrate PDGFR PDGFR-1 PDGFRB PGFRB_HUMAN Platelet-derived growth factor receptor 1 Platelet-derived growth factor receptor beta (PDGFR-beta) Platelet-derived growth factor receptor beta (PDGFRbeta) | VHL/PDGFRB
Type:
Enzyme
Mol. Mass.:
123922.25
Organism:
Homo sapiens (Human)
Description:
P09619
Residue:
1106
  
Inhibitor
Name:
BDBM50192844
Synonyms:
CHEMBL3358993
Type:
Small organic molecule
Emp. Form.:
C19H17ClN2O4
Mol. Mass.:
372.802
SMILES:
COc1cc(cc(OC)c1OC)-c1nc(c[nH]c1=O)-c1ccc(Cl)cc1
: