Target
Cytochrome P450 2D6
Ligand
BDBM50100556
Substrate
Meas. Tech.
ChEMBL_1456768 (CHEMBL3367090)
IC50
20000±n/a nM
Citation
 Park, EJAhn, YGJung, SHBang, HJKim, MHong, DJKim, JSuh, KHKim, YJKim, DKim, EYLee, KMin, KH Discovery of novel pyrimidine and malonamide derivatives as TGR5 agonists. Bioorg Med Chem Lett 24:4271-5 (2014)  
Target
Name:
Cytochrome P450 2D6
Synonyms:
CP2D6_HUMAN CYP2DL1 Cytochrome P450 2D6 (CYP2D6) P450-DB1
Type:
Protein
Mol. Mass.:
55774.82
Organism:
Homo sapiens (Human)
Description:
P10635
Residue:
497
  
Inhibitor
Name:
BDBM50100556
Synonyms:
CHEMBL3321845
Type:
Small organic molecule
Emp. Form.:
C20H16Cl2N4O2
Mol. Mass.:
415.273
SMILES:
CN1CCN(C(=O)c2cncnc2Oc2cc(Cl)ccc2Cl)c2ccccc12
: