Target
Cytochrome P450 2D6
Ligand
BDBM50121975
Substrate
Meas. Tech.
ChEMBL_1456768 (CHEMBL3367090)
IC50
<6.0±n/a nM
Citation
 Park, EJAhn, YGJung, SHBang, HJKim, MHong, DJKim, JSuh, KHKim, YJKim, DKim, EYLee, KMin, KH Discovery of novel pyrimidine and malonamide derivatives as TGR5 agonists. Bioorg Med Chem Lett 24:4271-5 (2014)  
Target
Name:
Cytochrome P450 2D6
Synonyms:
CP2D6_HUMAN CYP2DL1 Cytochrome P450 2D6 (CYP2D6) P450-DB1
Type:
Protein
Mol. Mass.:
55774.82
Organism:
Homo sapiens (Human)
Description:
P10635
Residue:
497
  
Inhibitor
Name:
BDBM50121975
Synonyms:
(6-Methoxy-quinolin-4-yl)-(5-vinyl-1-aza-bicyclo[2.2.2]oct-2-yl)-methanol CHEMBL1294 DURAQUIN QUINAGLUTE QUINATIME QUINIDINE US9402878, Quinidine
Type:
Small organic molecule
Emp. Form.:
C20H24N2O2
Mol. Mass.:
324.4168
SMILES:
COc1ccc2nccc([C@H](O)[C@H]3C[C@@H]4CCN3C[C@@H]4C=C)c2c1
: