Target
Cytochrome P450 3A4
Ligand
BDBM50100556
Substrate
Meas. Tech.
ChEMBL_1456764 (CHEMBL3367086)
IC50
250±n/a nM
Citation
 Park, EJAhn, YGJung, SHBang, HJKim, MHong, DJKim, JSuh, KHKim, YJKim, DKim, EYLee, KMin, KH Discovery of novel pyrimidine and malonamide derivatives as TGR5 agonists. Bioorg Med Chem Lett 24:4271-5 (2014)  
Target
Name:
Cytochrome P450 3A4
Synonyms:
Albendazole monooxygenase CP3A4_HUMAN CYP3A4 CYPIIIA4 Cytochrome P450 3A4 (CYP3A4) Nifedipine oxidase Taurochenodeoxycholate 6-alpha-hydroxylase
Type:
Enzyme
Mol. Mass.:
57349.57
Organism:
Homo sapiens (Human)
Description:
Residue:
503
  
Inhibitor
Name:
BDBM50100556
Synonyms:
CHEMBL3321845
Type:
Small organic molecule
Emp. Form.:
C20H16Cl2N4O2
Mol. Mass.:
415.273
SMILES:
CN1CCN(C(=O)c2cncnc2Oc2cc(Cl)ccc2Cl)c2ccccc12
: