Target
Cytochrome P450 1A2
Ligand
BDBM50100556
Substrate
Meas. Tech.
ChEMBL_1456765 (CHEMBL3367087)
IC50
20000±n/a nM
Citation
 Park, EJAhn, YGJung, SHBang, HJKim, MHong, DJKim, JSuh, KHKim, YJKim, DKim, EYLee, KMin, KH Discovery of novel pyrimidine and malonamide derivatives as TGR5 agonists. Bioorg Med Chem Lett 24:4271-5 (2014)  
Target
Name:
Cytochrome P450 1A2
Synonyms:
CP1A2_HUMAN CYPIA2 Cytochrome P(3)450 Cytochrome P450 1A2 (CYP1A2) Cytochrome P450-P3
Type:
Enzyme
Mol. Mass.:
58423.38
Organism:
Homo sapiens (Human)
Description:
P05177
Residue:
516
  
Inhibitor
Name:
BDBM50100556
Synonyms:
CHEMBL3321845
Type:
Small organic molecule
Emp. Form.:
C20H16Cl2N4O2
Mol. Mass.:
415.273
SMILES:
CN1CCN(C(=O)c2cncnc2Oc2cc(Cl)ccc2Cl)c2ccccc12
: