Target
C-X-C chemokine receptor type 4
Ligand
BDBM50166106
Substrate
Meas. Tech.
ChEMBL_1457659 (CHEMBL3368945)
IC50
4.0±n/a nM
Citation
 Zachariassen, ZGThiele, SBerg, EARasmussen, PFossen, TRosenkilde, MMVåbenø, JHaug, BE Design, synthesis, and biological evaluation of scaffold-based tripeptidomimetic antagonists for CXC chemokine receptor 4 (CXCR4). Bioorg Med Chem 22:4759-69 (2014)  
Target
Name:
C-X-C chemokine receptor type 4
Synonyms:
C-X-C chemokine receptor type 4 CD_antigen=CD184 CXCR-4 CXCR4_HUMAN Fusin LCR1 Leukocyte-derived seven transmembrane domain receptor SDF-1 receptor | Stromal cell-derived factor 1 receptor
Type:
Enzyme
Mol. Mass.:
39754.61
Organism:
Homo sapiens (Human)
Description:
P61073
Residue:
352
  
Inhibitor
Name:
BDBM50166106
Synonyms:
CHEMBL436283 cyclo(-D-Tyr-Arg-Arg-Nal-Gly-)
Type:
Small organic molecule
Emp. Form.:
C36H47N11O6
Mol. Mass.:
729.8285
SMILES:
[#7]\[#6](-[#7])=[#7]\[#6]-[#6]-[#6]-[#6@@H]-1-[#7]-[#6](=O)-[#6@H](-[#6]-[#6]-[#6]\[#7]=[#6](\[#7])-[#7])-[#7]-[#6](=O)-[#6@@H](-[#6]-c2ccc(-[#8])cc2)-[#7]-[#6](=O)-[#6]-[#7]-[#6](=O)-[#6@H](-[#6]-c2ccc3ccccc3c2)-[#7]-[#6]-1=O
: