Target
Hepatocyte growth factor receptor
Ligand
BDBM50100620
Substrate
Meas. Tech.
ChEMBL_1457677 (CHEMBL3368963)
IC50
>10000±n/a nM
Citation
 Shi, LWu, TTWang, ZXue, JYXu, YG Discovery of quinazolin-4-amines bearing benzimidazole fragments as dual inhibitors of c-Met and VEGFR-2. Bioorg Med Chem 22:4735-44 (2014)  
Target
Name:
Hepatocyte growth factor receptor
Synonyms:
Hepatocyte growth factor receptor Hepatocyte growth factor receptor (c-MET) MET Met proto-oncogene (hepatocyte growth factor receptor) Tyrosine-protein kinase Met (c-Met) c-Met kinase
Type:
Protein
Mol. Mass.:
155559.73
Organism:
Homo sapiens (Human)
Description:
P08581
Residue:
1390
  
Inhibitor
Name:
BDBM50100620
Synonyms:
CHEMBL3321908
Type:
Small organic molecule
Emp. Form.:
C22H14F3N5
Mol. Mass.:
405.3753
SMILES:
FC(F)(F)c1ccc(cc1)-c1nc2ccc(Nc3ncnc4ccccc34)cc2[nH]1
: