Target
Lysosomal acid glucosylceramidase
Ligand
BDBM50101398
Substrate
Meas. Tech.
ChEMBL_1460504 (CHEMBL3395306)
pH
5.5±n/a
Ki
66000±n/a nM
Comments
extracted
Citation
 Castilla, JRísquez, RHigaki, KNanba, EOhno, KSuzuki, YDíaz, YOrtiz Mellet, CGarcía Fernández, JMCastillón, S Conformationally-locked N-glycosides: exploiting long-range non-glycone interactions in the design of pharmacological chaperones for Gaucher disease. Eur J Med Chem 90:258-66 (2015)  
Target
Name:
Lysosomal acid glucosylceramidase
Synonyms:
Acid beta-glucosidase GBA GBA1_BOVIN | Glucosylceramidase
Type:
PROTEIN
Mol. Mass.:
59862.93
Organism:
Bos taurus
Description:
ChEMBL_1460504
Residue:
536
  
Inhibitor
Name:
BDBM50101398
Synonyms:
CHEMBL3393930
Type:
Small organic molecule
Emp. Form.:
C23H42FNO5S
Mol. Mass.:
463.647
SMILES:
[H][C@]12O[C@H](CO)[C@@H](O)[C@H](O)[C@@]1([H])OC(SCCCCCCCCCCCCCCCCF)=N2
: