Target
Proto-oncogene tyrosine-protein kinase Src
Ligand
BDBM50102871
Substrate
Meas. Tech.
ChEMBL_1461196 (CHEMBL3395759)
Ki
130±n/a nM
Citation
 Tintori, CFallacara, ALRadi, MZamperini, CDreassi, ECrespan, EMaga, GSchenone, SMusumeci, FBrullo, CRichters, AGasparrini, FAngelucci, AFestuccia, CDelle Monache, SRauh, DBotta, M Combining X-ray crystallography and molecular modeling toward the optimization of pyrazolo[3,4-d]pyrimidines as potent c-Src inhibitors active in vivo against neuroblastoma. J Med Chem 58:347-61 (2015)  
Target
Name:
Proto-oncogene tyrosine-protein kinase Src
Synonyms:
Calmodulin/Proto-oncogene tyrosine-protein kinase Src Proto-oncogene c-Src SRC SRC_HUMAN V-src sarcoma (Schmidt-Ruppin A-2) viral oncogene homolog (avian) p60-Src | pp60c-src
Type:
Protein
Mol. Mass.:
59838.60
Organism:
Homo sapiens (Human)
Description:
P12931
Residue:
536
  
Inhibitor
Name:
BDBM50102871
Synonyms:
CHEMBL3394084
Type:
Small organic molecule
Emp. Form.:
C23H24ClN5OS
Mol. Mass.:
453.988
SMILES:
CCCCSc1nc(Nc2cccc(O)c2)c2cnn(CC(Cl)c3ccccc3)c2n1
: