Target
Tyrosine-protein kinase JAK2
Ligand
BDBM50102648
Substrate
Meas. Tech.
ChEMBL_1442270 (CHEMBL3377096)
EC50
778±n/a nM
Citation
 de Vicente, JLemoine, RBartlett, MHermann, JCHekmat-Nejad, MHenningsen, RJin, SKuglstatter, ALi, HLovey, AJMenke, JNiu, LPatel, VPetersen, ASetti, LShao, ATivitmahaisoon, PVu, MDSoth, M Scaffold hopping towards potent and selective JAK3 inhibitors: discovery of novel C-5 substituted pyrrolopyrazines. Bioorg Med Chem Lett 24:4969-75 (2014)  
Target
Name:
Tyrosine-protein kinase JAK2
Synonyms:
JAK-2 JAK2_HUMAN Janus kinase 2 (JAK2) | Janus kinase 2 (a protein tyrosine kinase)
Type:
Protein
Mol. Mass.:
130684.68
Organism:
Homo sapiens (Human)
Description:
O60674
Residue:
1132
  
Inhibitor
Name:
BDBM50102648
Synonyms:
CHEMBL3335686
Type:
Small organic molecule
Emp. Form.:
C17H26N6O3S
Mol. Mass.:
394.492
SMILES:
CC(C)(C)CS(=O)(=O)N1CCC[C@@H](C1)NC(=O)Nc1cnc2[nH]ccc2n1
: