Target
Tyrosine-protein kinase JAK1
Ligand
BDBM50102671
Substrate
Meas. Tech.
ChEMBL_1443097 (CHEMBL3380803)
IC50
>30000±n/a nM
Citation
 Doig, PBoriack-Sjodin, PADumas, JHu, JItoh, KJohnson, KKazmirski, SKinoshita, TKuroda, SSato, TOSugimoto, KTohyama, KAoi, HWakamatsu, KWang, H Rational design of inhibitors of the bacterial cell wall synthetic enzyme GlmU using virtual screening and lead-hopping. Bioorg Med Chem 22:6256-69 (2014)  
Target
Name:
Tyrosine-protein kinase JAK1
Synonyms:
JAK-1 JAK1A JAK1_HUMAN Janus kinase 1 (JAK1) | Janus kinase 1 JAK1
Type:
Protein
Mol. Mass.:
133293.73
Organism:
Homo sapiens (Human)
Description:
P23458
Residue:
1154
  
Inhibitor
Name:
BDBM50102671
Synonyms:
CHEMBL3343047
Type:
Small organic molecule
Emp. Form.:
C21H19N3O4
Mol. Mass.:
377.3933
SMILES:
COc1cc(C(=O)Nc2ccc(NC(=O)c3ccccc3)cc2)c(N)cc1O
: