Target
Mu-type opioid receptor
Ligand
BDBM50102833
Substrate
Meas. Tech.
ChEMBL_1432431 (CHEMBL3385713)
EC50
0.400000±n/a nM
Citation
 Watanabe, YKitazawa, SFujii, HNemoto, THirayama, SIwai, TGouda, HHirono, SNagasea, H Design, synthesis, and structure-activity relationship of novel opioid¿ receptor selective agonists:a-iminoamide derivatives with an azabicyclo[2.2.2]octene skeleton. Bioorg Med Chem Lett 24:4980-3 (2014)  
Target
Name:
Mu-type opioid receptor
Synonyms:
M-OR-1 MOR-1 MUOR1 Mu opiate receptor OPRM1 hMOP | mu-type opioid receptor isoform MOR-1
Type:
G Protein-Coupled Receptor (GPCR)
Mol. Mass.:
44789.51
Organism:
Homo sapiens (Human)
Description:
P35372
Residue:
400
  
Inhibitor
Name:
BDBM50102833
Synonyms:
CHEMBL3339378
Type:
Small organic molecule
Emp. Form.:
C29H31N3O4
Mol. Mass.:
485.5741
SMILES:
Oc1ccc2CC3N(CC4CC4)CCC45C(Oc1c24)[C@@]1(O)CC[C@@]35N=C1C(=O)NCc1ccccc1
: