Target
Prostacyclin receptor
Ligand
BDBM50103396
Substrate
Meas. Tech.
ChEMBL_1463659 (CHEMBL3399046)
EC50
6.0±n/a nM
Citation
 Tran, TAShin, YJKramer, BChoi, JZou, NVallar, PMartens, PBoatman, PDAdams, JWRamirez, JShi, YMorgan, MUnett, DJChang, SShu, HHTung, SFSemple, G Discovery of a new series of potent prostacyclin receptor agonists with in vivo activity in rat. Bioorg Med Chem Lett 25:1030-5 (2015)  
Target
Name:
Prostacyclin receptor
Synonyms:
PGI receptor PRIPR Prostacyclin (IP) Receptor Prostaglandin I Prostaglandin I2 receptor | Prostanoid IP receptor
Type:
G Protein-Coupled Receptor (GPCR)
Mol. Mass.:
40968.22
Organism:
Homo sapiens (Human)
Description:
The membranes prepared from human platelet were used in binding assay.
Residue:
386
  
Inhibitor
Name:
BDBM50103396
Synonyms:
CHEMBL3398236
Type:
Small organic molecule
Emp. Form.:
C29H23F3N2O4
Mol. Mass.:
520.4991
SMILES:
OC(=O)COc1cccc2C[C@H](Cn3ncc(-c4cccc(F)c4F)c(-c4ccc(F)cc4)c3=O)CCc12
: