Target
Prostacyclin receptor
Ligand
BDBM50103413
Substrate
Meas. Tech.
ChEMBL_1463659 (CHEMBL3399046)
EC50
120±n/a nM
Citation
 Tran, TAShin, YJKramer, BChoi, JZou, NVallar, PMartens, PBoatman, PDAdams, JWRamirez, JShi, YMorgan, MUnett, DJChang, SShu, HHTung, SFSemple, G Discovery of a new series of potent prostacyclin receptor agonists with in vivo activity in rat. Bioorg Med Chem Lett 25:1030-5 (2015)  
Target
Name:
Prostacyclin receptor
Synonyms:
PGI receptor PRIPR Prostacyclin (IP) Receptor Prostaglandin I Prostaglandin I2 receptor | Prostanoid IP receptor
Type:
G Protein-Coupled Receptor (GPCR)
Mol. Mass.:
40968.22
Organism:
Homo sapiens (Human)
Description:
The membranes prepared from human platelet were used in binding assay.
Residue:
386
  
Inhibitor
Name:
BDBM50103413
Synonyms:
CHEMBL3398227
Type:
Small organic molecule
Emp. Form.:
C29H25FN2O4
Mol. Mass.:
484.5182
SMILES:
OC(=O)COc1cccc2CC(Cn3ncc(-c4ccccc4F)c(-c4ccccc4)c3=O)CCc12
: