Target
Solute carrier family 22 member 8
Ligand
BDBM50103525
Substrate
Meas. Tech.
ChEMBL_1482571 (CHEMBL3537392)
IC50
34900±n/a nM
Citation
 Wolman, ATGionfriddo, MRHeindel, GAMukhija, PWitkowski, SBommareddy, AVanwert, AL Organic anion transporter 3 interacts selectively with lipophilicß-lactam antibiotics. Drug Metab Dispos 41:791-800 (2013)  
Target
Name:
Solute carrier family 22 member 8
Synonyms:
Oat3 Organic anion transporter 3 Roct Slc22a8 mOat3
Type:
PROTEIN
Mol. Mass.:
59254.18
Organism:
Mus musculus
Description:
ChEMBL_104613
Residue:
537
  
Inhibitor
Name:
BDBM50103525
Synonyms:
CHEBI:7447 Nallpen | Unipen
Type:
Small organic molecule
Emp. Form.:
C21H22N2O5S
Mol. Mass.:
414.475
SMILES:
[H][C@]12SC(C)(C)[C@@H](N1C(=O)[C@H]2NC(=O)c1c(OCC)ccc2ccccc12)C(O)=O
: