Target
Solute carrier family 22 member 8
Ligand
BDBM50350467
Substrate
Meas. Tech.
ChEMBL_1482580 (CHEMBL3537401)
IC50
1780000±n/a nM
Citation
 Wolman, ATGionfriddo, MRHeindel, GAMukhija, PWitkowski, SBommareddy, AVanwert, AL Organic anion transporter 3 interacts selectively with lipophilicß-lactam antibiotics. Drug Metab Dispos 41:791-800 (2013)  
Target
Name:
Solute carrier family 22 member 8
Synonyms:
Oat3 S22A8_RAT rOat3
Type:
PROTEIN
Mol. Mass.:
59199.83
Organism:
Rattus norvegicus
Description:
ChEMBL_1482580
Residue:
536
  
Inhibitor
Name:
BDBM50350467
Synonyms:
BL-S578 Cefadrops
Type:
Small organic molecule
Emp. Form.:
C16H17N3O5S
Mol. Mass.:
363.388
SMILES:
CC1=C(N2[C@H](SC1)[C@H](NC(=O)[C@H](N)c1ccc(O)cc1)C2=O)C(O)=O
: