Target
Cytochrome P450 2C9
Ligand
BDBM50436176
Substrate
Meas. Tech.
ChEMBL_1493771 (CHEMBL3530854)
IC50
3660±n/a nM
Citation
 Lee, CAJones, JPKatayama, JKaspera, RJiang, YFreiwald, SSmith, EWalker, GSTotah, RA Identifying a selective substrate and inhibitor pair for the evaluation of CYP2J2 activity. Drug Metab Dispos 40:943-51 (2012)  
Target
Name:
Cytochrome P450 2C9
Synonyms:
(R)-limonene 6-monooxygenase CP2C9_HUMAN CYP2C9 Cytochrome P450 2C9 (CYP2C9 ) P-450MP P450 PB-1 | S-mephenytoin 4-hydroxylase
Type:
Enzyme
Mol. Mass.:
55636.33
Organism:
Homo sapiens (Human)
Description:
P11712
Residue:
490
  
Inhibitor
Name:
BDBM50436176
Synonyms:
Dynacirc ISRADIPINE PN-200-110
Type:
Small organic molecule
Emp. Form.:
C19H21N3O5
Mol. Mass.:
371.3871
SMILES:
COC(=O)C1=C(C)NC(C)=C(C1c1cccc2nonc12)C(=O)OC(C)C
: