Target
Cytochrome P450 2J2
Ligand
BDBM50101971
Substrate
Meas. Tech.
ChEMBL_1485701 (CHEMBL3541093)
IC50
3380±n/a nM
Citation
 Ren, SZeng, JMei, YZhang, JZYan, SFFei, JChen, L Discovery and characterization of novel, potent, and selective cytochrome P450 2J2 inhibitors. Drug Metab Dispos 41:60-71 (2012)  
Target
Name:
Cytochrome P450 2J2
Synonyms:
CP2J2_HUMAN | CYP2J2
Type:
Enzyme
Mol. Mass.:
57623.04
Organism:
Homo sapiens (Human)
Description:
P51589
Residue:
502
  
Inhibitor
Name:
BDBM50101971
Synonyms:
BAY-E-9736 Nimodipine | Nimotop
Type:
Small organic molecule
Emp. Form.:
C21H26N2O7
Mol. Mass.:
418.4403
SMILES:
COCCOC(=O)C1=C(C)NC(C)=C(C1c1cccc(c1)[N+]([O-])=O)C(=O)OC(C)C
: