Target
Glucose-dependent insulinotropic receptor
Ligand
BDBM50103553
Substrate
Meas. Tech.
ChEMBL_1434153 (CHEMBL3383390)
EC50
>5000±n/a nM
Citation
 Scott, JSBowker, SSBrocklehurst, KJBrown, HSClarke, DSEaster, AErtan, AGoldberg, KHudson, JAKavanagh, SLaber, DLeach, AGMacFaul, PAMartin, EAMcKerrecher, DSchofield, PSvensson, PHTeague, J Circumventing seizure activity in a series of G protein coupled receptor 119 (GPR119) agonists. J Med Chem 57:8984-98 (2014)  
Target
Name:
Glucose-dependent insulinotropic receptor
Synonyms:
GP119_MOUSE | Gpr119
Type:
PROTEIN
Mol. Mass.:
37009.07
Organism:
Mus musculus
Description:
ChEMBL_1506420
Residue:
335
  
Inhibitor
Name:
BDBM50103553
Synonyms:
CHEMBL3358004
Type:
Small organic molecule
Emp. Form.:
C21H23F4N7O3S
Mol. Mass.:
529.511
SMILES:
C[C@@H]1CN(CCN1c1ncc(OCc2ccc(CS(C)(=N)=O)cc2F)cn1)c1nnc(o1)C(F)(F)F
: