Target
Microtubule-associated protein tau
Ligand
BDBM50104107
Substrate
Meas. Tech.
ChEMBL_1505258 (CHEMBL3594883)
Ki
257±n/a nM
Citation
 Chu, WZhou, DGaba, VLiu, JLi, SPeng, XXu, JDhavale, DBagchi, DPd'Avignon, AShakerdge, NBBacskai, BJTu, ZKotzbauer, PTMach, RH Design, Synthesis, and Characterization of 3-(Benzylidene)indolin-2-one Derivatives as Ligands fora-Synuclein Fibrils. J Med Chem 58:6002-17 (2015)  
Target
Name:
Microtubule-associated protein tau
Synonyms:
MAPT MTBT1 Neurofibrillary tangle protein Paired helical filament-tau TAU_HUMAN | Tau Protein
Type:
Protein
Mol. Mass.:
78928.63
Organism:
Homo sapiens (Human)
Description:
P10636
Residue:
758
  
Inhibitor
Name:
BDBM50104107
Synonyms:
CHEMBL3593914
Type:
Small organic molecule
Emp. Form.:
C25H23N3O
Mol. Mass.:
381.4696
SMILES:
CN(C)c1ccc(\C=C\C=C2/C(=O)N(Cc3ccccc3)c3ncccc23)cc1
: