Target
Alpha-synuclein
Ligand
BDBM50103932
Substrate
Meas. Tech.
ChEMBL_1505256 (CHEMBL3594881)
Ki
25±n/a nM
Citation
 Chu, WZhou, DGaba, VLiu, JLi, SPeng, XXu, JDhavale, DBagchi, DPd'Avignon, AShakerdge, NBBacskai, BJTu, ZKotzbauer, PTMach, RH Design, Synthesis, and Characterization of 3-(Benzylidene)indolin-2-one Derivatives as Ligands fora-Synuclein Fibrils. J Med Chem 58:6002-17 (2015)  
Target
Name:
Alpha-synuclein
Synonyms:
NACP SNCA | SYUA_HUMAN
Type:
Protein
Mol. Mass.:
14451.42
Organism:
Homo sapiens (Human)
Description:
P37840
Residue:
140
  
Inhibitor
Name:
BDBM50103932
Synonyms:
CHEMBL3593924
Type:
Small organic molecule
Emp. Form.:
C24H18N2O3
Mol. Mass.:
382.4113
SMILES:
[O-][N+](=O)c1ccc(\C=C\C=C2/C(=O)N(Cc3ccccc3)c3ccccc23)cc1
: