Target
Alpha-synuclein
Ligand
BDBM50103934
Substrate
Meas. Tech.
ChEMBL_1505256 (CHEMBL3594881)
Ki
13±n/a nM
Citation
 Chu, WZhou, DGaba, VLiu, JLi, SPeng, XXu, JDhavale, DBagchi, DPd'Avignon, AShakerdge, NBBacskai, BJTu, ZKotzbauer, PTMach, RH Design, Synthesis, and Characterization of 3-(Benzylidene)indolin-2-one Derivatives as Ligands fora-Synuclein Fibrils. J Med Chem 58:6002-17 (2015)  
Target
Name:
Alpha-synuclein
Synonyms:
NACP SNCA | SYUA_HUMAN
Type:
Protein
Mol. Mass.:
14451.42
Organism:
Homo sapiens (Human)
Description:
P37840
Residue:
140
  
Inhibitor
Name:
BDBM50103934
Synonyms:
CHEMBL3593926
Type:
Small organic molecule
Emp. Form.:
C25H20N2O4
Mol. Mass.:
412.4373
SMILES:
COc1ccc(CN2C(=O)\C(=C/C=C/c3ccc(cc3)[N+]([O-])=O)c3ccccc23)cc1
: