Target
Amyloid-beta precursor protein
Ligand
BDBM50103966
Substrate
Meas. Tech.
ChEMBL_1505257 (CHEMBL3594882)
Ki
40±n/a nM
Citation
 Chu, WZhou, DGaba, VLiu, JLi, SPeng, XXu, JDhavale, DBagchi, DPd'Avignon, AShakerdge, NBBacskai, BJTu, ZKotzbauer, PTMach, RH Design, Synthesis, and Characterization of 3-(Benzylidene)indolin-2-one Derivatives as Ligands fora-Synuclein Fibrils. J Med Chem 58:6002-17 (2015)  
Target
Name:
Amyloid-beta precursor protein
Synonyms:
A4 ABPP AICD-50 AICD-59 AID(57) APP Alzheimer disease amyloid protein Amyloid beta Protein Amyloid beta protein Abeta(1-42) Amyloid intracellular domain 57 Amyloid protein (Abeta42b) Beta amyloid A4 protein Beta-APP42 Beta-amyloid protein 42 C83 CVAP Gamma Secretase Gamma-CTF(57) Gamma-secretase Gamma-secretase C-terminal fragment 57 P3(40) PN-II Protease nexin-II S-APP-beta Soluble APP-beta | beta-Amyloid Precursor Protein (APP)
Type:
Single-pass type I membrane protein
Mol. Mass.:
86890.41
Organism:
Homo sapiens (Human)
Description:
P05067
Residue:
770
  
Inhibitor
Name:
BDBM50103966
Synonyms:
CHEMBL3593893
Type:
Small organic molecule
Emp. Form.:
C16H15N3O
Mol. Mass.:
265.3098
SMILES:
CN(C)c1ccc(\C=C2/C(=O)Nc3ncccc23)cc1
: