Target
Alpha-synuclein
Ligand
BDBM50104105
Substrate
Meas. Tech.
ChEMBL_1505256 (CHEMBL3594881)
Ki
92±n/a nM
Citation
 Chu, WZhou, DGaba, VLiu, JLi, SPeng, XXu, JDhavale, DBagchi, DPd'Avignon, AShakerdge, NBBacskai, BJTu, ZKotzbauer, PTMach, RH Design, Synthesis, and Characterization of 3-(Benzylidene)indolin-2-one Derivatives as Ligands fora-Synuclein Fibrils. J Med Chem 58:6002-17 (2015)  
Target
Name:
Alpha-synuclein
Synonyms:
NACP SNCA | SYUA_HUMAN
Type:
Protein
Mol. Mass.:
14451.42
Organism:
Homo sapiens (Human)
Description:
P37840
Residue:
140
  
Inhibitor
Name:
BDBM50104105
Synonyms:
CHEMBL3593912
Type:
Small organic molecule
Emp. Form.:
C24H21N3O
Mol. Mass.:
367.443
SMILES:
CN(C)c1ccc(\C=C\C=C2/C(=O)N(c3ccccc23)c2ccncc2)cc1
: