Target
Alpha-synuclein
Ligand
BDBM50103929
Substrate
Meas. Tech.
ChEMBL_1505256 (CHEMBL3594881)
Ki
207±n/a nM
Citation
 Chu, WZhou, DGaba, VLiu, JLi, SPeng, XXu, JDhavale, DBagchi, DPd'Avignon, AShakerdge, NBBacskai, BJTu, ZKotzbauer, PTMach, RH Design, Synthesis, and Characterization of 3-(Benzylidene)indolin-2-one Derivatives as Ligands fora-Synuclein Fibrils. J Med Chem 58:6002-17 (2015)  
Target
Name:
Alpha-synuclein
Synonyms:
NACP SNCA | SYUA_HUMAN
Type:
Protein
Mol. Mass.:
14451.42
Organism:
Homo sapiens (Human)
Description:
P37840
Residue:
140
  
Inhibitor
Name:
BDBM50103929
Synonyms:
CHEMBL3593901
Type:
Small organic molecule
Emp. Form.:
C17H13NO
Mol. Mass.:
247.2912
SMILES:
O=C1Nc2ccccc2\C1=C\C=C\c1ccccc1
: