Target
Protein mono-ADP-ribosyltransferase PARP15
Ligand
BDBM50104286
Substrate
Meas. Tech.
ChEMBL_1505402 (CHEMBL3595285)
IC50
>10000±n/a nM
Citation
 Nkizinkiko, YSuneel Kumar, BVJeankumar, VUHaikarainen, TKoivunen, JMadhuri, CYogeeswari, PVenkannagari, HObaji, EPihlajaniemi, TSriram, DLehtiö, L Discovery of potent and selective nonplanar tankyrase inhibiting nicotinamide mimics. Bioorg Med Chem 23:4139-49 (2015)  
Target
Name:
Protein mono-ADP-ribosyltransferase PARP15
Synonyms:
(ARTD7 or PARP15) 2.4.2.- ADP-ribosyltransferase diphtheria toxin-like 7 B-aggressive lymphoma protein 3 Human diphtheria toxin-like ADP-ribosyltransferase (ARTD7 or PARP15, Y598L) PARP-15 Poly [ADP-ribose] polymerase 15 | Synonyms=BAL3
Type:
Mol. Mass.:
74595.89
Organism:
Homo sapiens (Human)
Description:
Q460N3
Residue:
678
  
Inhibitor
Name:
BDBM50104286
Synonyms:
CHEMBL3593715
Type:
Small organic molecule
Emp. Form.:
C18H23N5O
Mol. Mass.:
325.4081
SMILES:
O=c1[nH]c(nc2CCCCc12)N1CCN(Cc2ccncc2)CC1
: