Target
Protein mono-ADP-ribosyltransferase PARP3 [R100H]
Ligand
BDBM50104286
Substrate
Meas. Tech.
ChEMBL_1505400 (CHEMBL3595283)
IC50
13000±n/a nM
Citation
 Nkizinkiko, YSuneel Kumar, BVJeankumar, VUHaikarainen, TKoivunen, JMadhuri, CYogeeswari, PVenkannagari, HObaji, EPihlajaniemi, TSriram, DLehtiö, L Discovery of potent and selective nonplanar tankyrase inhibiting nicotinamide mimics. Bioorg Med Chem 23:4139-49 (2015)  
Target
Name:
Protein mono-ADP-ribosyltransferase PARP3 [R100H]
Synonyms:
(ARTD3 or PARP3) ADPRT3 Human diphtheria toxin-like ADP-ribosyltransferase (ARTD3 or PARP3) PARP3_HUMAN Poly [ADP-ribose] polymerase 3 (PARP-3) | Poly(ADP-ribose) polymerase-3 (ARTD3/PARP3)
Type:
PROTEIN
Mol. Mass.:
60071.85
Organism:
Homo sapiens (Human)
Description:
Q9Y6F1[R100H]
Residue:
533
  
Inhibitor
Name:
BDBM50104286
Synonyms:
CHEMBL3593715
Type:
Small organic molecule
Emp. Form.:
C18H23N5O
Mol. Mass.:
325.4081
SMILES:
O=c1[nH]c(nc2CCCCc12)N1CCN(Cc2ccncc2)CC1
: