Target
Estrogen receptor
Ligand
BDBM50104809
Substrate
Meas. Tech.
ChEMBL_1508098 (CHEMBL3599826)
IC50
>1000±n/a nM
Citation
 Demizu, YMisawa, TNagakubo, TKanda, YOkuhira, KSekino, YNaito, MKurihara, M Structural development of stabilized helical peptides as inhibitors of estrogen receptor (ER)-mediated transcription. Bioorg Med Chem 23:4132-8 (2015)  
Target
Name:
Estrogen receptor
Synonyms:
ER ESR ESR1_HUMAN Estrogen receptor Estrogen receptor (ER-alpha) Estrogen receptor alpha (ER) Nuclear receptor subfamily 3 group A member 1
Type:
Protein
Mol. Mass.:
66230.44
Organism:
Homo sapiens (Human)
Description:
P03372
Residue:
595
  
Inhibitor
Name:
BDBM50104809
Synonyms:
CHEMBL3597500
Type:
Small organic molecule
Emp. Form.:
C52H95N19O10
Mol. Mass.:
1146.432
SMILES:
CC[C@H](C)[C@H](NC(=O)C(CC)NC(=O)[C@@H](N)CCCNC(N)=N)C(=O)N[C@@H](CC(C)C)C(=O)N[C@@H](Cc1cnc[nH]1)C(=O)N[C@@H](CCCNC(N)=N)C(=O)NC(CC(C)(C)C)C(=O)N[C@@H](CC(C)C)C(=O)N[C@@H](CCC(N)=O)C(N)=O
: