Target
Histone deacetylase 3
Ligand
BDBM50005711
Substrate
Meas. Tech.
ChEMBL_1506755 (CHEMBL3598914)
Ki
0.500000±n/a nM
Citation
 Carrillo, AKGuiguemde, WAGuy, RK Evaluation of histone deacetylase inhibitors (HDACi) as therapeutic leads for human African trypanosomiasis (HAT). Bioorg Med Chem 23:5151-5 (2015)  
Target
Name:
Histone deacetylase 3
Synonyms:
HD3 HDAC3_HUMAN Human HDAC3 SMAP45
Type:
Enzyme
Mol. Mass.:
48829.55
Organism:
Homo sapiens (Human)
Description:
O15379
Residue:
428
  
Inhibitor
Name:
BDBM50005711
Synonyms:
CHEBI:46024 TRICHOSTATIN Trichostatin A (TSA) US10722597, Compound Trichostatin US20230322747, Compound trichostatin A | US9265734, TSA
Type:
Small organic molecule
Emp. Form.:
C17H22N2O3
Mol. Mass.:
302.3682
SMILES:
C[C@H](\C=C(/C)\C=C\C(=O)NO)C(=O)c1ccc(cc1)N(C)C
: