Target
Histone deacetylase 3
Ligand
BDBM50123957
Substrate
Meas. Tech.
ChEMBL_1506755 (CHEMBL3598914)
Ki
2.7±n/a nM
Citation
 Carrillo, AKGuiguemde, WAGuy, RK Evaluation of histone deacetylase inhibitors (HDACi) as therapeutic leads for human African trypanosomiasis (HAT). Bioorg Med Chem 23:5151-5 (2015)  
Target
Name:
Histone deacetylase 3
Synonyms:
HD3 HDAC3_HUMAN Human HDAC3 SMAP45
Type:
Enzyme
Mol. Mass.:
48829.55
Organism:
Homo sapiens (Human)
Description:
O15379
Residue:
428
  
Inhibitor
Name:
BDBM50123957
Synonyms:
(E)-5-(3-Benzenesulfonylamino-phenyl)-pent-2-en-4-ynoic acid hydroxyamide 5-(4-Benzenesulfonylamino-phenyl)-pent-2-en-4-ynoic acid hydroxyamide Oxamflatin
Type:
Small organic molecule
Emp. Form.:
C17H14N2O4S
Mol. Mass.:
342.369
SMILES:
ONC(=O)\C=C\C#Cc1ccc(NS(=O)(=O)c2ccccc2)cc1
: