Target
Histone deacetylase 8
Ligand
BDBM50123957
Substrate
Meas. Tech.
ChEMBL_1506756 (CHEMBL3598915)
Ki
0.100000±n/a nM
Citation
 Carrillo, AKGuiguemde, WAGuy, RK Evaluation of histone deacetylase inhibitors (HDACi) as therapeutic leads for human African trypanosomiasis (HAT). Bioorg Med Chem 23:5151-5 (2015)  
Target
Name:
Histone deacetylase 8
Synonyms:
HD8 HDAC8_HUMAN Histone deacetylase 8 (HDAC-8) | Human HDAC8
Type:
Enzyme
Mol. Mass.:
41749.60
Organism:
Homo sapiens (Human)
Description:
Q9BY41
Residue:
377
  
Inhibitor
Name:
BDBM50123957
Synonyms:
(E)-5-(3-Benzenesulfonylamino-phenyl)-pent-2-en-4-ynoic acid hydroxyamide 5-(4-Benzenesulfonylamino-phenyl)-pent-2-en-4-ynoic acid hydroxyamide Oxamflatin
Type:
Small organic molecule
Emp. Form.:
C17H14N2O4S
Mol. Mass.:
342.369
SMILES:
ONC(=O)\C=C\C#Cc1ccc(NS(=O)(=O)c2ccccc2)cc1
: