Target
Aminopeptidase N
Ligand
BDBM50353018
Substrate
Meas. Tech.
ChEMBL_1507526 (CHEMBL3599782)
Ki
0.060000±n/a nM
Citation
 Revelant, GAl-Lakkis-Wehbe, MSchmitt, MAlavi, SSchmitt, CRoux, LAl-Masri, MSchifano-Faux, NMaiereanu, CTarnus, CAlbrecht, S Exploring S1 plasticity and probing S1' subsite of mammalian aminopeptidase N/CD13 with highly potent and selective aminobenzosuberone inhibitors. Bioorg Med Chem 23:3192-207 (2015)  
Target
Name:
Aminopeptidase N
Synonyms:
AMPN_HUMAN APN Aminopeptidase CD_antigen=CD13 Myeloid plasma membrane glycoprotein CD13 gp150 | hAPN
Type:
PROTEIN
Mol. Mass.:
109522.63
Organism:
Homo sapiens (Human)
Description:
ChEMBL_1507526
Residue:
967
  
Inhibitor
Name:
BDBM50353018
Synonyms:
CHEMBL1821980 | CHEMBL1852660
Type:
Small organic molecule
Emp. Form.:
C17H16BrNO
Mol. Mass.:
330.219
SMILES:
NC1CCc2c(Br)ccc(-c3ccccc3)c2CC1=O
: