Target
Aminopeptidase N
Ligand
BDBM50353016
Substrate
Meas. Tech.
ChEMBL_1507527 (CHEMBL3599783)
Ki
7.0±n/a nM
Citation
 Revelant, GAl-Lakkis-Wehbe, MSchmitt, MAlavi, SSchmitt, CRoux, LAl-Masri, MSchifano-Faux, NMaiereanu, CTarnus, CAlbrecht, S Exploring S1 plasticity and probing S1' subsite of mammalian aminopeptidase N/CD13 with highly potent and selective aminobenzosuberone inhibitors. Bioorg Med Chem 23:3192-207 (2015)  
Target
Name:
Aminopeptidase N
Synonyms:
AMPN_PIG AP-M Alanyl aminopeptidase Aminopeptidase N (APN) Microsomal aminopeptidase pAPN
Type:
Protein
Mol. Mass.:
108810.25
Organism:
Sus scrofa (Pig)
Description:
P15145
Residue:
963
  
Inhibitor
Name:
BDBM50353016
Synonyms:
CHEMBL1821978
Type:
Small organic molecule
Emp. Form.:
C17H17NO
Mol. Mass.:
251.323
SMILES:
NC1CCc2cccc(c2CC1=O)-c1ccccc1
: