Target
Adenosylhomocysteinase
Ligand
BDBM50050877
Substrate
Meas. Tech.
ChEMBL_1507791 (CHEMBL3598548)
IC50
13±n/a nM
Citation
 Nakao, ASuzuki, HUeno, HIwasaki, HSetsuta, TKashima, ASunada, S Discovery and structural analyses of S-adenosyl-L-homocysteine hydrolase inhibitors based on non-adenosine analogs. Bioorg Med Chem 23:4952-69 (2015)  
Target
Name:
Adenosylhomocysteinase
Synonyms:
AHCY SAHH | SAHH_HUMAN
Type:
PROTEIN
Mol. Mass.:
47714.06
Organism:
Homo sapiens (Human)
Description:
ChEMBL_1507791
Residue:
432
  
Inhibitor
Name:
BDBM50050877
Synonyms:
CHEMBL3322547
Type:
Small organic molecule
Emp. Form.:
C31H35Cl2N5O3
Mol. Mass.:
596.547
SMILES:
CN(N1Cc2ccccc2C1)C(=O)CN(CC(=O)NCCN1CCCC1)c1cc(Cl)ccc1Oc1ccc(Cl)cc1
: