Target
Dual specificity tyrosine-phosphorylation-regulated kinase 1A
Ligand
BDBM50105912
Substrate
Meas. Tech.
ChEMBL_1508020 (CHEMBL3599390)
IC50
500±n/a nM
Citation
 Yadav, RRSharma, SJoshi, PWani, AVishwakarma, RAKumar, ABharate, SB Meridianin derivatives as potent Dyrk1A inhibitors and neuroprotective agents. Bioorg Med Chem Lett 25:2948-52 (2015)  
Target
Name:
Dual specificity tyrosine-phosphorylation-regulated kinase 1A
Synonyms:
DYR1A_HUMAN DYRK1A Dual specificity YAK1-related kinase 1A (Dyrk1A) Dual-specificity tyrosine-phosphorylation regulated kinase 1A HP86 MNBH
Type:
Enzyme
Mol. Mass.:
85616.61
Organism:
Homo sapiens (Human)
Description:
Q13627
Residue:
763
  
Inhibitor
Name:
BDBM50105912
Synonyms:
CHEMBL3133762
Type:
Small organic molecule
Emp. Form.:
C17H16BrN5O2
Mol. Mass.:
402.245
SMILES:
Nc1nccc(n1)-c1cn(C(=O)N2CCOCC2)c2ccc(Br)cc12
: