Target
Nuclear receptor ROR-beta
Ligand
BDBM50105933
Substrate
Meas. Tech.
ChEMBL_1506256 (CHEMBL3599140)
EC50
1700±n/a nM
Citation
 Wang, TBanerjee, DBohnert, TChao, JEnyedy, IFontenot, JGuertin, KJones, HLin, EYMarcotte, DTalreja, TVan Vloten, K Discovery of novel pyrazole-containing benzamides as potent ROR¿ inverse agonists. Bioorg Med Chem Lett 25:2985-90 (2015)  
Target
Name:
Nuclear receptor ROR-beta
Synonyms:
NR1F2 Nuclear receptor subfamily 1 group F member 2 RORB_HUMAN Retinoid-related orphan receptor-beta
Type:
PROTEIN
Mol. Mass.:
53227.30
Organism:
Homo sapiens (Human)
Description:
ChEMBL_107979
Residue:
470
  
Inhibitor
Name:
BDBM50105933
Synonyms:
CHEMBL3598051
Type:
Small organic molecule
Emp. Form.:
C27H29ClFN5O2
Mol. Mass.:
510.003
SMILES:
CC(C)n1nc(NC(C)=O)cc1-c1ccc(N(C)C(=O)c2c(F)cccc2Cl)c(c1)N1CC2CC2C1
: