Target
Nuclear receptor ROR-beta
Ligand
BDBM50105984
Substrate
Meas. Tech.
ChEMBL_1506256 (CHEMBL3599140)
EC50
6200±n/a nM
Citation
 Wang, TBanerjee, DBohnert, TChao, JEnyedy, IFontenot, JGuertin, KJones, HLin, EYMarcotte, DTalreja, TVan Vloten, K Discovery of novel pyrazole-containing benzamides as potent ROR¿ inverse agonists. Bioorg Med Chem Lett 25:2985-90 (2015)  
Target
Name:
Nuclear receptor ROR-beta
Synonyms:
NR1F2 Nuclear receptor subfamily 1 group F member 2 RORB_HUMAN Retinoid-related orphan receptor-beta
Type:
PROTEIN
Mol. Mass.:
53227.30
Organism:
Homo sapiens (Human)
Description:
ChEMBL_107979
Residue:
470
  
Inhibitor
Name:
BDBM50105984
Synonyms:
CHEMBL3598054
Type:
Small organic molecule
Emp. Form.:
C26H28ClFN6O2
Mol. Mass.:
514.009
SMILES:
[2H]C([2H])([2H])N(C(=O)c1c(F)cccc1Cl)c1ncc(cc1N1CC2CC2C1)-c1cc(NC(C)=O)nn1C(C)C
: