Target
Nuclear receptor ROR-beta
Ligand
BDBM50106287
Substrate
Meas. Tech.
ChEMBL_1506468 (CHEMBL3599867)
EC50
>10000±n/a nM
Citation
 Fauber, BPGobbi, ARobarge, KZhou, ABarnard, ACao, JDeng, YEidenschenk, CEverett, CGanguli, AHawkins, JJohnson, ARLa, HNorman, MSalmon, GSummerhill, SOuyang, WTang, WWong, H Discovery of imidazo[1,5-a]pyridines and -pyrimidines as potent and selective RORc inverse agonists. Bioorg Med Chem Lett 25:2907-12 (2015)  
Target
Name:
Nuclear receptor ROR-beta
Synonyms:
NR1F2 Nuclear receptor subfamily 1 group F member 2 RORB_HUMAN Retinoid-related orphan receptor-beta
Type:
PROTEIN
Mol. Mass.:
53227.30
Organism:
Homo sapiens (Human)
Description:
ChEMBL_107979
Residue:
470
  
Inhibitor
Name:
BDBM50106287
Synonyms:
CHEMBL3598148 | US9550771, Example 17
Type:
Small organic molecule
Emp. Form.:
C22H12ClF3N2O4
Mol. Mass.:
460.79
SMILES:
OC(=O)c1ccc(cc1O)-c1nc(C(=O)c2c(Cl)cccc2C(F)(F)F)n2ccccc12
: