Target
Nuclear receptor ROR-alpha
Ligand
BDBM50106285
Substrate
Meas. Tech.
ChEMBL_1506555 (CHEMBL3600176)
EC50
>10000±n/a nM
Citation
 Fauber, BPGobbi, ARobarge, KZhou, ABarnard, ACao, JDeng, YEidenschenk, CEverett, CGanguli, AHawkins, JJohnson, ARLa, HNorman, MSalmon, GSummerhill, SOuyang, WTang, WWong, H Discovery of imidazo[1,5-a]pyridines and -pyrimidines as potent and selective RORc inverse agonists. Bioorg Med Chem Lett 25:2907-12 (2015)  
Target
Name:
Nuclear receptor ROR-alpha
Synonyms:
NR1F1 Nuclear receptor subfamily 1 group F member 1 RORA RZRA | Retinoid-related orphan receptor-alpha
Type:
PROTEIN
Mol. Mass.:
58976.26
Organism:
Homo sapiens (Human)
Description:
ChEMBL_101591
Residue:
523
  
Inhibitor
Name:
BDBM50106285
Synonyms:
CHEMBL3596279 | US9550771, Example 91
Type:
Small organic molecule
Emp. Form.:
C23H16ClN3O4
Mol. Mass.:
433.844
SMILES:
OC(=O)c1ccc(cc1O)-c1nc(C(=O)c2c(Cl)cccc2C2CC2)n2cccnc12
: