Target
Nuclear receptor ROR-gamma
Ligand
BDBM50106286
Substrate
Meas. Tech.
ChEMBL_1506463 (CHEMBL3599862)
EC50
10.0±n/a nM
Citation
 Fauber, BPGobbi, ARobarge, KZhou, ABarnard, ACao, JDeng, YEidenschenk, CEverett, CGanguli, AHawkins, JJohnson, ARLa, HNorman, MSalmon, GSummerhill, SOuyang, WTang, WWong, H Discovery of imidazo[1,5-a]pyridines and -pyrimidines as potent and selective RORc inverse agonists. Bioorg Med Chem Lett 25:2907-12 (2015)  
Target
Name:
Nuclear receptor ROR-gamma
Synonyms:
NR1F3 Nuclear receptor ROR-gamma (RORC) RAR-related orphan receptor C (RORc) RORG RZRG Retinoid-related orphan receptor-gamma (RORc)
Type:
Enzyme Catalytic Domain
Mol. Mass.:
58218.40
Organism:
Homo sapiens (Human)
Description:
P51449
Residue:
518
  
Inhibitor
Name:
BDBM50106286
Synonyms:
CHEMBL3598141 | US9550771, Example 27
Type:
Small organic molecule
Emp. Form.:
C22H12ClF3N2O3
Mol. Mass.:
444.79
SMILES:
OC(=O)c1ccc(cc1)-c1nc(C(=O)c2c(Cl)cccc2C(F)(F)F)n2ccccc12
: