Target
Carbonic anhydrase 9
Ligand
BDBM50106419
Substrate
Meas. Tech.
ChEMBL_1508538 (CHEMBL3602574)
Ki
30±n/a nM
Citation
 Meleddu, RMaccioni, EDistinto, SBianco, GMelis, CAlcaro, SCottiglia, FCeruso, MSupuran, CT New 4-[(3-cyclohexyl-4-aryl-2,3-dihydro-1,3-thiazol-2-ylidene)amino]benzene-1-sulfonamides, synthesis and inhibitory activity toward carbonic anhydrase I, II, IX, XII. Bioorg Med Chem Lett 25:3281-4 (2015)  
Target
Name:
Carbonic anhydrase 9
Synonyms:
CA-IX CAH9_HUMAN Carbonic anhydrase 9 (CA IX) Carbonic anhydrase 9 precursor Carbonic anhydrase IX (CAIX) Carbonic anhydrases; II & IX MN RCC-associated antigen G250
Type:
Enzyme
Mol. Mass.:
49669.03
Organism:
Homo sapiens (Human)
Description:
Catalytic domain of human cloned isozyme was used in the assay
Residue:
459
  
Inhibitor
Name:
BDBM50106419
Synonyms:
CHEMBL3601886
Type:
Small organic molecule
Emp. Form.:
C22H22N4O2S2
Mol. Mass.:
438.566
SMILES:
NS(=O)(=O)c1ccc(cc1)\N=c1/scc(-c2ccc(cc2)C#N)n1C1CCCCC1
: