Target
Aurora kinase A
Ligand
BDBM50106624
Substrate
Meas. Tech.
ChEMBL_1508718 (CHEMBL3602981)
Kd
0.730000±n/a nM
Citation
 Lavogina, DKisand, KRaidaru, GUri, A Fluorescent photoaffinity probes for mitotic protein kinase Aurora A. Bioorg Med Chem Lett 25:3290-4 (2015)  
Target
Name:
Aurora kinase A
Synonyms:
AIK ARK1 AURKA AYK1 Aurora kinase A (AURA) Aurora kinase A (Aurora A) Aurora-related kinase 1 BTAK Breast-tumor-amplified kinase STK15 Serine/threonine kinase 15 Serine/threonine-protein kinase aurora A hARK1
Type:
Serine/threonine-protein kinase
Mol. Mass.:
45830.98
Organism:
Homo sapiens (Human)
Description:
O14965
Residue:
403
  
Inhibitor
Name:
BDBM50106624
Synonyms:
CHEMBL3600870
Type:
Small organic molecule
Emp. Form.:
C104H148ClFN37O15S
Mol. Mass.:
2243.043
SMILES:
CN(C)c1ccc2C(C3C=CC(C=C3Oc2c1)=[N+](C)C)c1ccc(cc1C(O)=O)C(=O)NCCCC[C@@H](NC(=O)[C@H](CCCNC(N)=N)NC(=O)[C@H](CCCNC(N)=N)NC(=O)[C@H](CCCNC(N)=N)NC(=O)[C@H](CCCNC(N)=N)NC(=O)[C@H](CCCNC(N)=N)NC(=O)[C@H](CCCNC(N)=N)NC(=O)[C@H](Cc1ccc(cc1)N=[N+]=[N-])NC(=O)CCCCCNC(=O)[C@@]1(Cc2cccc(Nc3nccs3)n2)CC[C@@H](CC1)Oc1cccc(Cl)c1F)C(N)=O
: